Reaction Details
TargetDelta-type opioid receptor
LigandBDBM86663
Substrate/Competitorn/a
Ki 0.22±n/a nM
CommentsPDSP_4771
Citation Tryoen-Tóth, PDécaillot, FMFilliol, DBefort, KLazarus, LHSchiller, PWSchmidhammer, HKieffer, BL Inverse agonism and neutral antagonism at wild-type and constitutively active mutant delta opioid receptors. J Pharmacol Exp Ther313:410-21 (2005) 
 
Delta-type opioid receptor
Name:Delta-type opioid receptor
Type:G Protein-Coupled Receptor (GPCR)
Mol. Mass.:40382.98
Organism:Homo sapiens (Human)
Description:Competition binding assays were carried out using membrane preparations from transfected HN9.10 cells that constitutively expressed the delta opioid receptor.
Residue:372
BDBM86663
NameBDBM86663
Synonyms:CAS_0 NSC_0
TypeSmall organic molecule
Emp. Form.C28H29NO5
Mol. Mass.459.5336
SMILESCOc1c2O[C@@]3(C)c4oc5ccccc5c4C[C@@]4(O)C5Cc(cc1O)c2C34CCN5CC1CC1