Reaction Details
TargetDelta-type opioid receptor
LigandBDBM86260
Substrate/Competitorn/a
Ki 66.2±n/a nM
CommentsPDSP_1282
Citation Tryoen-Tóth, PDécaillot, FMFilliol, DBefort, KLazarus, LHSchiller, PWSchmidhammer, HKieffer, BL Inverse agonism and neutral antagonism at wild-type and constitutively active mutant delta opioid receptors. J Pharmacol Exp Ther313:410-21 (2005) 
 
Delta-type opioid receptor
Name:Delta-type opioid receptor
Type:G Protein-Coupled Receptor (GPCR)
Mol. Mass.:40382.98
Organism:Homo sapiens (Human)
Description:Competition binding assays were carried out using membrane preparations from transfected HN9.10 cells that constitutively expressed the delta opioid receptor.
Residue:372
BDBM86260
NameBDBM86260
Synonyms:CAS_465-65-6 NSC_10064 | Naloxone(-)
TypeSmall organic molecule
Emp. Form.C19H21NO4
Mol. Mass.327.3743
SMILESOc1ccc2CC3N(CC=C)CCC45C(Oc1c24)C(=O)CCC35O