Reaction Details
TargetDelta-type opioid receptor
LigandBDBM82552
Substrate/Competitorn/a
Ki 0.1±n/a nM
CommentsPDSP_1396
Citation Tryoen-Tóth, PDécaillot, FMFilliol, DBefort, KLazarus, LHSchiller, PWSchmidhammer, HKieffer, BL Inverse agonism and neutral antagonism at wild-type and constitutively active mutant delta opioid receptors. J Pharmacol Exp Ther313:410-21 (2005) 
 
Delta-type opioid receptor
Name:Delta-type opioid receptor
Type:G Protein-Coupled Receptor (GPCR)
Mol. Mass.:40382.98
Organism:Homo sapiens (Human)
Description:Competition binding assays were carried out using membrane preparations from transfected HN9.10 cells that constitutively expressed the delta opioid receptor.
Residue:372
BDBM82552
NameBDBM82552
Synonyms:CAS_111555-58-9 naltrindolebenzofuran
TypeSmall organic molecule
Emp. Form.C26H25NO4
Mol. Mass.415.481
SMILESOc1ccc2C[C@H]3N(CC4CC4)CC[C@@]45[C@@H](Oc1c24)c1oc2ccccc2c1C[C@@]35O