Reaction Details
TargetDelta-type opioid receptor
LigandBDBM86666
Substrate/Competitorn/a
Ki 4.62±n/a nM
CommentsPDSP_4763
Citation Tryoen-Tóth, PDécaillot, FMFilliol, DBefort, KLazarus, LHSchiller, PWSchmidhammer, HKieffer, BL Inverse agonism and neutral antagonism at wild-type and constitutively active mutant delta opioid receptors. J Pharmacol Exp Ther313:410-21 (2005) 
 
Delta-type opioid receptor
Name:Delta-type opioid receptor
Type:G Protein-Coupled Receptor (GPCR)
Mol. Mass.:40382.98
Organism:Homo sapiens (Human)
Description:Competition binding assays were carried out using membrane preparations from transfected HN9.10 cells that constitutively expressed the delta opioid receptor.
Residue:372
BDBM86666
NameBDBM86666
Synonyms:TICP -psi
TypeSmall organic molecule
Emp. Form.C37H46N4O5
Mol. Mass.626.7849
SMILESNC(Cc1ccc(O)cc1)C(=O)N1Cc2ccccc2CC1CNC(Cc1ccccc1)C(=O)NC(CC1CCCCC1)C(O)=O