Reaction Details
TargetEstrogen receptor
LigandBDBM50005414
Substrate/Competitorn/a
Ki 0.83±n/a nM
CommentsPDSP_5078
Citation Kurata, YTabata, YShinei, RIizuka, YMasuda, NTKurihara, KOkonogi, THoshiko, S Endocrinological properties of two novel nonsteroidal progesterone receptor modulators, CP8816 and CP8863. J Pharmacol Exp Ther313:916-20 (2005) 
 
Estrogen receptor
Name:Estrogen receptor
Type:Protein
Mol. Mass.:66230.44
Organism:Homo sapiens (Human)
Description:P03372
Residue:595
BDBM50005414
NameBDBM50005414
Synonyms:(estradiol)13-Methyl-7,8,9,11,12,13,14,15,16,17-decahydro-6H-cyclopenta[a]phenanthrene-3,17-diol 13-Methyl-7,8,9,11,12,13,14,15,16,17-decahydro-6H-cyclopenta[a]phenanthrene-3,17-diol 13-Methyl-7,8,9,11,12,13,14,15,16,17-decahydro-6H-cyclopenta[a]phenanthrene-3,17-diol( Estradiol) 13-Methyl-7,8,9,11,12,13,14,15,16,17-decahydro-6H-cyclopenta[a]phenanthrene-3,17-diol(17beta-estradiol) 13-Methyl-7,8,9,11,12,13,14,15,16,17-decahydro-6H-cyclopenta[a]phenanthrene-3,17-diol(estradiol) 17beta-Estradiol ESTRADIOL | Estradiol13-Methyl-7,8,9,11,12,13,14,15,16,17-decahydro-6H-cyclopenta[a]phenanthrene-3,17-diol
TypeSmall organic molecule
Emp. Form.C18H24O2
Mol. Mass.272.382
SMILESCC12CCC3C(CCc4cc(O)ccc34)C1CCC2O