Reaction Details
TargetBile salt export pump
LigandBDBM50011032
Substrate/Competitorn/a
Ki>10000±n/a nM
CommentsPDSP_5739
Citation Hirano, MMaeda, KHayashi, HKusuhara, HSugiyama, Y Bile salt export pump (BSEP/ABCB11) can transport a nonbile acid substrate, pravastatin. J Pharmacol Exp Ther314:876-82 (2005) 
 
Bile salt export pump
Name:Bile salt export pump
Type:PROTEIN
Mol. Mass.:146267.86
Organism:Rattus norvegicus
Description:ChEMBL_1481883
Residue:1321
BDBM50011032
NameBDBM50011032
Synonyms:5-(4-Fluoro-phenyl)-1-[2-(4-hydroxy-6-oxo-tetrahydro-pyran-2-yl)-ethyl]-2-isopropyl-4-phenyl-1H-pyrrole-3-carboxylic acid phenylamide CHEMBL333687 | US9006282, Example 3, Compound 2
TypeSmall organic molecule
Emp. Form.C33H33FN2O4
Mol. Mass.540.6245
SMILESCC(C)c1c(C(=O)Nc2ccccc2)c(c(-c2ccc(F)cc2)n1CC[C@@H]1C[C@@H](O)CC(=O)O1)-c1ccccc1