Reaction Details
TargetBile salt export pump
LigandBDBM86704
Substrate/Competitorn/a
Ki>10000±n/a nM
CommentsPDSP_5734
Citation Hirano, MMaeda, KHayashi, HKusuhara, HSugiyama, Y Bile salt export pump (BSEP/ABCB11) can transport a nonbile acid substrate, pravastatin. J Pharmacol Exp Ther314:876-82 (2005) 
 
Bile salt export pump
Name:Bile salt export pump
Type:Protein
Mol. Mass.:146405.49
Organism:Homo sapiens (Human)
Description:O95342
Residue:1321
BDBM86704
NameBDBM86704
Synonyms:CAS_93957-54-1 cid_446155
TypeSmall organic molecule
Emp. Form.C24H26FNO4
Mol. Mass.411.4659
SMILESCC(C)n1c(\C=C\[C@@H](O)C[C@@H](O)CC(O)=O)c(-c2ccc(F)cc2)c2ccccc12