Reaction Details
TargetBile salt export pump
LigandBDBM86705
Substrate/Competitorn/a
Ki>10000±n/a nM
CommentsPDSP_5740
Citation Hirano, MMaeda, KHayashi, HKusuhara, HSugiyama, Y Bile salt export pump (BSEP/ABCB11) can transport a nonbile acid substrate, pravastatin. J Pharmacol Exp Ther314:876-82 (2005) 
 
Bile salt export pump
Name:Bile salt export pump
Type:Protein
Mol. Mass.:146405.49
Organism:Homo sapiens (Human)
Description:O95342
Residue:1321
BDBM86705
NameBDBM86705
Synonyms:CAS_141750-63-2 | Pitavastatin lactone
TypeSmall organic molecule
Emp. Form.C25H22FNO3
Mol. Mass.403.4455
SMILESO[C@@H]1C[C@H](OC(=O)C1)\C=C\c1c(nc2ccccc2c1-c1ccc(F)cc1)C1CC1