Reaction Details
TargetBile salt export pump
LigandBDBM18372
Substrate/Competitorn/a
Ki>10000±n/a nM
CommentsPDSP_5737
Citation Hirano, MMaeda, KHayashi, HKusuhara, HSugiyama, Y Bile salt export pump (BSEP/ABCB11) can transport a nonbile acid substrate, pravastatin. J Pharmacol Exp Ther314:876-82 (2005) 
 
Bile salt export pump
Name:Bile salt export pump
Type:PROTEIN
Mol. Mass.:146267.86
Organism:Rattus norvegicus
Description:ChEMBL_1481883
Residue:1321
BDBM18372
NameBDBM18372
Synonyms:(3R,5S,6E)-7-[4-(4-fluorophenyl)-2-(N-methylmethanesulfonamido)-6-(propan-2-yl)pyrimidin-5-yl]-3,5-dihydroxyhept-6-enoic acid Ros US9102656, Rosuvastatin | ZD4522
TypeSmall organic molecule
Emp. Form.C22H28FN3O6S
Mol. Mass.481.538
SMILESCC(C)c1nc(nc(-c2ccc(F)cc2)c1\C=C\[C@@H](O)C[C@@H](O)CC(O)=O)N(C)S(C)(=O)=O