Reaction Details
TargetKappa-type opioid receptor
LigandBDBM86548
Substrate/Competitorn/a
Ki 31.6±n/a nM
CommentsPDSP_2950
Citation Yan, FMosier, PDWestkaemper, RBStewart, JZjawiony, JKVortherms, TASheffler, DJRoth, BL Identification of the molecular mechanisms by which the diterpenoid salvinorin A binds to kappa-opioid receptors. Biochemistry44:8643-51 (2005) 
 
Kappa-type opioid receptor
Name:Kappa-type opioid receptor
Type:G Protein-Coupled Receptor (GPCR)
Mol. Mass.:42648.76
Organism:Homo sapiens (Human)
Description:P41145
Residue:380
BDBM86548
NameBDBM86548
Synonyms:CAS_83729-01-5 Salvinorin A
TypeSmall organic molecule
Emp. Form.C23H28O8
Mol. Mass.432.4636
SMILESCOC(=O)C1CC(OC(C)=O)C(=O)C2C1(C)CCC1C(=O)OC(CC21C)c1ccoc1