Reaction Details
TargetMetabotropic glutamate receptor 5
LigandBDBM86717
Substrate/Competitorn/a
Ki 328.4±n/a nM
CommentsPDSP_4886
Citation Porter, RHJaeschke, GSpooren, WBallard, TMBüttelmann, BKolczewski, SPeters, JUPrinssen, EWichmann, JVieira, EMühlemann, AGatti, SMutel, VMalherbe, P Fenobam: a clinically validated nonbenzodiazepine anxiolytic is a potent, selective, and noncompetitive mGlu5 receptor antagonist with inverse agonist activity. J Pharmacol Exp Ther315:711-21 (2005) 
 
Metabotropic glutamate receptor 5
Name:Metabotropic glutamate receptor 5
Type:Enzyme
Mol. Mass.:132484.72
Organism:Homo sapiens (Human)
Description:n/a
Residue:1212
BDBM86717
NameBDBM86717
Synonyms:CAS_5218788 NSC_5218788 | SIB-1757
TypeSmall organic molecule
Emp. Form.C12H11N3O
Mol. Mass.213.2352
SMILESCc1ccc(O)c(N=Nc2ccccc2)n1