Reaction Details
TargetMetabotropic glutamate receptor 5
LigandBDBM86715
Substrate/Competitorn/a
Ki 333.7±n/a nM
CommentsPDSP_3236
Citation Porter, RHJaeschke, GSpooren, WBallard, TMBüttelmann, BKolczewski, SPeters, JUPrinssen, EWichmann, JVieira, EMühlemann, AGatti, SMutel, VMalherbe, P Fenobam: a clinically validated nonbenzodiazepine anxiolytic is a potent, selective, and noncompetitive mGlu5 receptor antagonist with inverse agonist activity. J Pharmacol Exp Ther315:711-21 (2005) 
 
Metabotropic glutamate receptor 5
Name:Metabotropic glutamate receptor 5
Type:Enzyme
Mol. Mass.:132484.72
Organism:Homo sapiens (Human)
Description:n/a
Residue:1212
BDBM86715
NameBDBM86715
Synonyms:CAS_5311432 SIB-1893
TypeSmall organic molecule
Emp. Form.C14H13N
Mol. Mass.195.2597
SMILESCc1cccc(C=Cc2ccccc2)n1