Reaction Details
TargetMetabotropic glutamate receptor 5
LigandBDBM86715
Substrate/Competitorn/a
Ki 242.9±n/a nM
CommentsPDSP_3236
Citation Porter, RHJaeschke, GSpooren, WBallard, TMBüttelmann, BKolczewski, SPeters, JUPrinssen, EWichmann, JVieira, EMühlemann, AGatti, SMutel, VMalherbe, P Fenobam: a clinically validated nonbenzodiazepine anxiolytic is a potent, selective, and noncompetitive mGlu5 receptor antagonist with inverse agonist activity. J Pharmacol Exp Ther315:711-21 (2005) 
 
Metabotropic glutamate receptor 5
Name:Metabotropic glutamate receptor 5
Type:Enzyme
Mol. Mass.:131900.14
Organism:Rattus norvegicus (Rat)
Description:P31424
Residue:1203
BDBM86715
NameBDBM86715
Synonyms:CAS_5311432 SIB-1893
TypeSmall organic molecule
Emp. Form.C14H13N
Mol. Mass.195.2597
SMILESCc1cccc(C=Cc2ccccc2)n1