Reaction Details
TargetD(2) dopamine receptor
LigandBDBM22870
Substrate/Competitorn/a
Ki 38±n/a nM
CommentsPDSP_290
Citation Burstein, ESMa, JWong, SGao, YPham, EKnapp, AENash, NROlsson, RDavis, REHacksell, UWeiner, DMBrann, MR Intrinsic efficacy of antipsychotics at human D2, D3, and D4 dopamine receptors: identification of the clozapine metabolite N-desmethylclozapine as a D2/D3 partial agonist. J Pharmacol Exp Ther315:1278-87 (2005) 
 
D(2) dopamine receptor
Name:D(2) dopamine receptor
Type:Cell-surface receptors
Mol. Mass.:50647.10
Organism:Homo sapiens (Human)
Description:P14416
Residue:443
BDBM22870
NameBDBM22870
Synonyms:13-chloro-10-(piperazin-1-yl)-2-oxa-9-azatricyclo[9.4.0.0^{3,8}]pentadeca-1(11),3,5,7,9,12,14-heptaene Amoxapine CHEMBL1113 | Demolox
TypeSmall organic molecule
Emp. Form.C17H16ClN3O
Mol. Mass.313.781
SMILESClc1ccc2Oc3ccccc3N=C(N3CCNCC3)c2c1