Reaction Details
TargetD(2) dopamine receptor
LigandBDBM86721
Substrate/Competitorn/a
Ki 0.3±n/a nM
CommentsPDSP_447
Citation Burstein, ESMa, JWong, SGao, YPham, EKnapp, AENash, NROlsson, RDavis, REHacksell, UWeiner, DMBrann, MR Intrinsic efficacy of antipsychotics at human D2, D3, and D4 dopamine receptors: identification of the clozapine metabolite N-desmethylclozapine as a D2/D3 partial agonist. J Pharmacol Exp Ther315:1278-87 (2005) 
 
D(2) dopamine receptor
Name:D(2) dopamine receptor
Type:Cell-surface receptors
Mol. Mass.:50647.10
Organism:Homo sapiens (Human)
Description:P14416
Residue:443
BDBM86721
NameBDBM86721
Synonyms:BUTACLAMOL NSC_37459 | US11147820, Compound Butaclamol
TypeSmall organic molecule
Emp. Form.C25H31NO
Mol. Mass.361.5197
SMILESCC(C)(C)C1(O)CCN2CC3c4ccccc4CCc4cccc(C2C1)c34