Reaction Details
TargetD(2) dopamine receptor
LigandBDBM78434
Substrate/Competitorn/a
Ki 0.2±n/a nM
CommentsPDSP_1531
Citation Burstein, ESMa, JWong, SGao, YPham, EKnapp, AENash, NROlsson, RDavis, REHacksell, UWeiner, DMBrann, MR Intrinsic efficacy of antipsychotics at human D2, D3, and D4 dopamine receptors: identification of the clozapine metabolite N-desmethylclozapine as a D2/D3 partial agonist. J Pharmacol Exp Ther315:1278-87 (2005) 
 
D(2) dopamine receptor
Name:D(2) dopamine receptor
Type:Cell-surface receptors
Mol. Mass.:50647.10
Organism:Homo sapiens (Human)
Description:P14416
Residue:443
BDBM78434
NameBDBM78434
Synonyms:2-chloranyl-10-[3-(4-methylpiperazin-1-yl)propyl]phenothiazine;ethane-1,2-disulfonic acid 2-chloro-10-[3-(4-methylpiperazin-1-yl)propyl]phenothiazine;ethane-1,2-disulfonic acid Compazine MLS001148133 SMR000653454 | cid_91499
TypeSmall organic molecule
Emp. Form.C20H24ClN3S
Mol. Mass.373.943
SMILESCN1CCN(CCCN2c3ccccc3Sc3ccc(Cl)cc23)CC1