Reaction Details
TargetD(2) dopamine receptor
LigandBDBM50048803
Substrate/Competitorn/a
Ki 5.7±n/a nM
CommentsPDSP_1996
Citation Burstein, ESMa, JWong, SGao, YPham, EKnapp, AENash, NROlsson, RDavis, REHacksell, UWeiner, DMBrann, MR Intrinsic efficacy of antipsychotics at human D2, D3, and D4 dopamine receptors: identification of the clozapine metabolite N-desmethylclozapine as a D2/D3 partial agonist. J Pharmacol Exp Ther315:1278-87 (2005) 
 
D(2) dopamine receptor
Name:D(2) dopamine receptor
Type:Cell-surface receptors
Mol. Mass.:50647.10
Organism:Homo sapiens (Human)
Description:P14416
Residue:443
BDBM50048803
NameBDBM50048803
Synonyms:5-(2-(4-(benzo[d]isothiazol-3-yl)piperazin-1-yl)ethyl)-6-chloroindolin-2-one 5-[2-(4-Benzo[d]isothiazol-3-yl-piperazin-1-yl)-ethyl]-6-chloro-1,3-dihydro-indol-2-one (Ziprasidone) CHEMBL708 ZIPRASIDONE | ZIPRASIDONE HYDROCHLORIDE
TypeSmall organic molecule
Emp. Form.C21H21ClN4OS
Mol. Mass.412.936
SMILESClc1cc2NC(=O)Cc2cc1CCN1CCN(CC1)c1nsc2ccccc12