Reaction Details
TargetD(3) dopamine receptor
LigandBDBM81484
Substrate/Competitorn/a
Ki 2.3±n/a nM
CommentsPDSP_428
Citation Burstein, ESMa, JWong, SGao, YPham, EKnapp, AENash, NROlsson, RDavis, REHacksell, UWeiner, DMBrann, MR Intrinsic efficacy of antipsychotics at human D2, D3, and D4 dopamine receptors: identification of the clozapine metabolite N-desmethylclozapine as a D2/D3 partial agonist. J Pharmacol Exp Ther315:1278-87 (2005) 
 
D(3) dopamine receptor
Name:D(3) dopamine receptor
Type:n/a
Mol. Mass.:44243.43
Organism:Homo sapiens (Human)
Description:n/a
Residue:400
BDBM81484
NameBDBM81484
Synonyms:BROMPERIDOL CAS_2448 | NSC_2448
TypeSmall organic molecule
Emp. Form.C21H23BrFNO2
Mol. Mass.420.315
SMILESOC1(CCN(CCCC(=O)c2ccc(F)cc2)CC1)c1ccc(Br)cc1