Reaction Details
TargetD(3) dopamine receptor
LigandBDBM86723
Substrate/Competitorn/a
Ki 0.7±n/a nM
CommentsPDSP_5080
Citation Burstein, ESMa, JWong, SGao, YPham, EKnapp, AENash, NROlsson, RDavis, REHacksell, UWeiner, DMBrann, MR Intrinsic efficacy of antipsychotics at human D2, D3, and D4 dopamine receptors: identification of the clozapine metabolite N-desmethylclozapine as a D2/D3 partial agonist. J Pharmacol Exp Ther315:1278-87 (2005) 
 
D(3) dopamine receptor
Name:D(3) dopamine receptor
Type:n/a
Mol. Mass.:44243.43
Organism:Homo sapiens (Human)
Description:n/a
Residue:400
BDBM86723
NameBDBM86723
Synonyms:CAS_14759-06-9 sulforidazine
TypeSmall organic molecule
Emp. Form.C21H26N2O2S2
Mol. Mass.402.573
SMILESCN1CCCCC1CCN1c2ccccc2Sc2ccc(cc12)S(C)(=O)=O