Reaction Details
TargetcAMP-dependent protein kinase catalytic subunit beta
LigandBDBM15211
Substrate/Competitorn/a
Ki 50±n/a nM
CommentsPDSP_6135
Citation Braverman, ASTibb, ASRuggieri, MR M2 and M3 muscarinic receptor activation of urinary bladder contractile signal transduction. I. Normal rat bladder. J Pharmacol Exp Ther316:869-74 (2006) 
 
cAMP-dependent protein kinase catalytic subunit beta
Name:cAMP-dependent protein kinase catalytic subunit beta
Type:Enzyme Catalytic Domain
Mol. Mass.:40715.41
Organism:RAT
Description:PKA 0 RAT::P68182
Residue:351
BDBM15211
NameBDBM15211
Synonyms:CHEMBL104264 H89 N-(2-{[(2E)-3-(4-bromophenyl)prop-2-en-1-yl]amino}ethyl)isoquinoline-5-sulfonamide | N-[2-[[(E)-3-(4-bromophenyl)prop-2-enyl]amino]ethyl]isoquinoline-5-sulfonamide
TypeSmall organic molecule
Emp. Form.C20H20BrN3O2S
Mol. Mass.446.361
SMILESBrc1ccc(\C=C\CNCCNS(=O)(=O)c2cccc3cnccc23)cc1