Reaction Details
TargetMacrophage-stimulating protein receptor
LigandBDBM13530
Substrate/Competitorn/a
Ki>10000±n/a nM
CommentsPDSP_6372
Citation Melnick, JSJanes, JKim, SChang, JYSipes, DGGunderson, DJarnes, LMatzen, JTGarcia, MEHood, TLBeigi, RXia, GHarig, RAAsatryan, HYan, SFZhou, YGu, XJSaadat, AZhou, VKing, FJShaw, CMSu, AIDowns, RGray, NSSchultz, PGWarmuth, MCaldwell, JS An efficient rapid system for profiling the cellular activities of molecular libraries. Proc Natl Acad Sci U S A103:3153-8 (2006) 
 
Macrophage-stimulating protein receptor
Name:Macrophage-stimulating protein receptor
Type:Protein
Mol. Mass.:152270.76
Organism:Homo sapiens (Human)
Description:Q04912
Residue:1400
BDBM13530
NameBDBM13530
Synonyms:4-[(4-methylpiperazin-1-yl)methyl]-N-[4-methyl-3-[(4-pyridin-3-ylpyrimidin-2-yl)amino]phenyl]benzamide Gleevec Imatinib, 21 STI-571 US10906896, Cpd imatinib US11725005, Compound imatinib cid_5291 med.21724, Compound 6
TypeSmall organic molecule
Emp. Form.C29H31N7O
Mol. Mass.493.6027
SMILESCN1CCN(Cc2ccc(cc2)C(=O)Nc2ccc(C)c(Nc3nccc(n3)-c3cccnc3)c2)CC1