Reaction Details
TargetGlutaminase kidney isoform, mitochondrial
LigandBDBM278413
Substrate/Competitorn/a
Meas. Tech.GLS Enzyme Potency Assay
pH7.8±n/a
IC50 18.6±n/a nM
Commentsextracted
Citation Finlay, MREkwuru, CTCharles, MDRaubo, PAWinter, JJNissink, JW 1,3,4-thiadiazole compounds and their use in treating cancer US Patent US10040788 Publication Date 8/7/2018
 
Glutaminase kidney isoform, mitochondrial
Name:Glutaminase kidney isoform, mitochondrial
Type:Protein
Mol. Mass.:73471.89
Organism:Homo sapiens (Human)
Description:O94925
Residue:669
BDBM278413
NameBDBM278413
Synonyms:(2S)-2-Methoxy-N-[5-[[(3R)-1-pyridazin-3-ylpyrrolidin-3-yl]amino]-1,3,4-thiadiazol-2-yl]-2-[3-(trifluoromethoxy)phenyl]acetamide US10294221, Example 9(a)
TypeSmall organic molecule
Emp. Form.C20H20F3N7O3S
Mol. Mass.495.478
SMILESCO[C@H](C(=O)Nc1nnc(N[C@@H]2CCN(C2)c2cccnn2)s1)c1cccc(OC(F)(F)F)c1