Reaction Details
TargetGlutaminase kidney isoform, mitochondrial
LigandBDBM278433
Substrate/Competitorn/a
Meas. Tech.GLS Enzyme Potency Assay
pH7.8±n/a
IC50 46.9±n/a nM
Commentsextracted
Citation Finlay, MREkwuru, CTCharles, MDRaubo, PAWinter, JJNissink, JW 1,3,4-thiadiazole compounds and their use in treating cancer US Patent US10040788 Publication Date 8/7/2018
 
Glutaminase kidney isoform, mitochondrial
Name:Glutaminase kidney isoform, mitochondrial
Type:Protein
Mol. Mass.:73471.89
Organism:Homo sapiens (Human)
Description:O94925
Residue:669
BDBM278433
NameBDBM278433
Synonyms:US10040788, Example 21(b)
TypeSmall organic molecule
Emp. Form.C19H22N8O3S
Mol. Mass.442.495
SMILESCO[C@H](C(=O)Nc1nnc(N[C@H]2CCN(C2)c2cncnn2)s1)c1cccc(OC)c1