Reaction Details
TargetNeuronal acetylcholine receptor subunit alpha-4
LigandBDBM50100717
Substrate/Competitorn/a
Ki 0.020±n/a nM
CommentsPDSP_8564
Citation Ivy Carroll, FYokota, YMa, WLee, JRBrieaddy, LEBurgess, JPNavarro, HADamaj, MIMartin, BR Synthesis, nicotinic acetylcholine receptor binding, and pharmacological properties of 3'-(substituted phenyl)deschloroepibatidine analogs. Bioorg Med Chem16:746-54 (2008) 
 
Neuronal acetylcholine receptor subunit alpha-4
Name:Neuronal acetylcholine receptor subunit alpha-4
Type:Enzyme
Mol. Mass.:70196.44
Organism:Rattus norvegicus (Rat)
Description:P09483
Residue:630
BDBM50100717
NameBDBM50100717
Synonyms:2-(pyridin-3-yl)-7-aza-bicyclo[2.2.1]heptane CHEMBL56817
TypeSmall organic molecule
Emp. Form.C11H14N2
Mol. Mass.174.2423
SMILESC1CC2NC1CC2c1cccnc1