Reaction Details
TargetNeuronal acetylcholine receptor subunit alpha-4
LigandBDBM86820
Substrate/Competitorn/a
Ki 0.17±n/a nM
CommentsPDSP_8559
Citation Ivy Carroll, FYokota, YMa, WLee, JRBrieaddy, LEBurgess, JPNavarro, HADamaj, MIMartin, BR Synthesis, nicotinic acetylcholine receptor binding, and pharmacological properties of 3'-(substituted phenyl)deschloroepibatidine analogs. Bioorg Med Chem16:746-54 (2008) 
 
Neuronal acetylcholine receptor subunit alpha-4
Name:Neuronal acetylcholine receptor subunit alpha-4
Type:Enzyme
Mol. Mass.:70196.44
Organism:Rattus norvegicus (Rat)
Description:P09483
Residue:630
BDBM86820
NameBDBM86820
Synonyms:CAS_45263774 rac-3'-(3-chlorophenyl)deschloroepibatidine dihydrochloride
TypeSmall organic molecule
Emp. Form.C17H17ClN2
Mol. Mass.284.783
SMILESClc1cccc(c1)-c1cncc(c1)C1CC2CCC1N2