Reaction Details
TargetNeuronal acetylcholine receptor subunit alpha-4
LigandBDBM86821
Substrate/Competitorn/a
Ki 0.20±n/a nM
CommentsPDSP_8557
Citation Ivy Carroll, FYokota, YMa, WLee, JRBrieaddy, LEBurgess, JPNavarro, HADamaj, MIMartin, BR Synthesis, nicotinic acetylcholine receptor binding, and pharmacological properties of 3'-(substituted phenyl)deschloroepibatidine analogs. Bioorg Med Chem16:746-54 (2008) 
 
Neuronal acetylcholine receptor subunit alpha-4
Name:Neuronal acetylcholine receptor subunit alpha-4
Type:Enzyme
Mol. Mass.:70196.44
Organism:Rattus norvegicus (Rat)
Description:P09483
Residue:630
BDBM86821
NameBDBM86821
Synonyms:CAS_45263766 rac-3'-(3-fluorophenyl)deschloroepibatidine dihydrochloride
TypeSmall organic molecule
Emp. Form.C17H17FN2
Mol. Mass.268.3287
SMILESFc1cccc(c1)-c1cncc(c1)C1CC2CCC1N2