Reaction Details
TargetNeuronal acetylcholine receptor subunit alpha-4
LigandBDBM86814
Substrate/Competitorn/a
Ki 0.34±n/a nM
CommentsPDSP_8556
Citation Ivy Carroll, FYokota, YMa, WLee, JRBrieaddy, LEBurgess, JPNavarro, HADamaj, MIMartin, BR Synthesis, nicotinic acetylcholine receptor binding, and pharmacological properties of 3'-(substituted phenyl)deschloroepibatidine analogs. Bioorg Med Chem16:746-54 (2008) 
 
Neuronal acetylcholine receptor subunit alpha-4
Name:Neuronal acetylcholine receptor subunit alpha-4
Type:Enzyme
Mol. Mass.:70196.44
Organism:Rattus norvegicus (Rat)
Description:P09483
Residue:630
BDBM86814
NameBDBM86814
Synonyms:CAS_45266060 rac-3'-(4-nitrophenyl)deschloroepibatidine dihydrochloride
TypeSmall organic molecule
Emp. Form.C17H17N3O2
Mol. Mass.295.3358
SMILES[O-][N+](=O)c1ccc(cc1)-c1cncc(c1)C1CC2CCC1N2