Reaction Details
TargetNeuronal acetylcholine receptor subunit alpha-4
LigandBDBM86824
Substrate/Competitorn/a
Ki 0.5±n/a nM
CommentsPDSP_8561
Citation Ivy Carroll, FYokota, YMa, WLee, JRBrieaddy, LEBurgess, JPNavarro, HADamaj, MIMartin, BR Synthesis, nicotinic acetylcholine receptor binding, and pharmacological properties of 3'-(substituted phenyl)deschloroepibatidine analogs. Bioorg Med Chem16:746-54 (2008) 
 
Neuronal acetylcholine receptor subunit alpha-4
Name:Neuronal acetylcholine receptor subunit alpha-4
Type:Enzyme
Mol. Mass.:70196.44
Organism:Rattus norvegicus (Rat)
Description:P09483
Residue:630
BDBM86824
NameBDBM86824
Synonyms:CAS_45266048 rac-3-phenyldeschloroepibatidine dihydrochloride
TypeSmall organic molecule
Emp. Form.C17H18N2
Mol. Mass.250.3382
SMILESC1CC2NC1CC2c1cncc(c1)-c1ccccc1