Reaction Details
TargetAlpha-1D adrenergic receptor
LigandBDBM86848
Substrate/Competitorn/a
Ki 1.2±n/a nM
CommentsPDSP_8536
Citation Chiu, GLi, SConnolly, PJPulito, VLiu, JMiddleton, SA (Phenylpiperazinyl)cyclohexylureas: discovery of alpha1a/1d-selective adrenergic receptor antagonists for the treatment of benign prostatic hyperplasia/lower urinary tract symptoms (BPH/LUTS). Bioorg Med Chem Lett18:640-4 (2008) 
 
Alpha-1D adrenergic receptor
Name:Alpha-1D adrenergic receptor
Type:Enzyme Catalytic Domain
Mol. Mass.:60485.82
Organism:Homo sapiens (Human)
Description:adrenergic Alpha1D ADRA1D HUMAN::P25100
Residue:572
BDBM86848
NameBDBM86848
Synonyms:1-(2,5-difluorophenyl)-3-(4-(4-(2-isopropoxyphenyl)piperazin-1-yl)cyclohexyl)urea NSC_16041629
TypeSmall organic molecule
Emp. Form.C26H34F2N4O2
Mol. Mass.472.5706
SMILESCC(C)Oc1ccccc1N1CCN(CC1)C1CCC(CC1)NC(=O)Nc1cc(F)ccc1F