Reaction Details
TargetAlpha-1D adrenergic receptor
LigandBDBM86846
Substrate/Competitorn/a
Ki 0.20±n/a nM
CommentsPDSP_2090
Citation Chiu, GLi, SConnolly, PJPulito, VLiu, JMiddleton, SA (Phenylpiperazinyl)cyclohexylureas: discovery of alpha1a/1d-selective adrenergic receptor antagonists for the treatment of benign prostatic hyperplasia/lower urinary tract symptoms (BPH/LUTS). Bioorg Med Chem Lett18:640-4 (2008) 
 
Alpha-1D adrenergic receptor
Name:Alpha-1D adrenergic receptor
Type:Enzyme Catalytic Domain
Mol. Mass.:60485.82
Organism:Homo sapiens (Human)
Description:adrenergic Alpha1D ADRA1D HUMAN::P25100
Residue:572
BDBM86846
NameBDBM86846
Synonyms:CAS_106133-20-4 Tamsulosin
TypeSmall organic molecule
Emp. Form.C20H28N2O5S
Mol. Mass.408.512
SMILESCCOc1ccccc1OCCNC(C)Cc1ccc(OC)c(c1)S(N)(=O)=O