Reaction Details
TargetD(2) dopamine receptor
LigandBDBM86844
Substrate/Competitorn/a
Ki 1.20±n/a nM
CommentsPDSP_8538
Citation Chiu, GLi, SConnolly, PJPulito, VLiu, JMiddleton, SA (Phenylpiperazinyl)cyclohexylureas: discovery of alpha1a/1d-selective adrenergic receptor antagonists for the treatment of benign prostatic hyperplasia/lower urinary tract symptoms (BPH/LUTS). Bioorg Med Chem Lett18:640-4 (2008) 
 
D(2) dopamine receptor
Name:D(2) dopamine receptor
Type:Cell-surface receptors
Mol. Mass.:50647.10
Organism:Homo sapiens (Human)
Description:P14416
Residue:443
BDBM86844
NameBDBM86844
Synonyms:1-(5-chloro-2-methoxyphenyl)-3-(4-(4-(2-isopropoxyphenyl)piperazin-1-yl)cyclohexyl)urea NSC_16041451
TypeSmall organic molecule
Emp. Form.C27H37ClN4O3
Mol. Mass.501.061
SMILESCOc1ccc(Cl)cc1NC(=O)NC1CCC(CC1)N1CCN(CC1)c1ccccc1OC(C)C