Reaction Details
TargetMu-type opioid receptor
LigandBDBM86493
Substrate/Competitorn/a
Ki 0.3±n/a nM
CommentsPDSP_2945
Citation Ghirmai, SAzar, MRPolgar, WEBerzetei-Gurske, ICashman, JR Synthesis and biological evaluation of alpha- and beta-6-amido derivatives of 17-cyclopropylmethyl-3, 14beta-dihydroxy-4, 5alpha-epoxymorphinan: potential alcohol-cessation agents. J Med Chem51:1913-24 (2008) 
 
Mu-type opioid receptor
Name:Mu-type opioid receptor
Type:G Protein-Coupled Receptor (GPCR)
Mol. Mass.:44789.51
Organism:Homo sapiens (Human)
Description:P35372
Residue:400
BDBM86493
NameBDBM86493
Synonyms:CAS_27943 NSC_27943 | Naltrexone
TypeSmall organic molecule
Emp. Form.C20H23NO4
Mol. Mass.341.4009
SMILESOc1ccc2CC3N(CC4CC4)CCC45C(Oc1c24)C(=O)CCC35O