Reaction Details
TargetDelta-type opioid receptor
LigandBDBM86933
Substrate/Competitorn/a
Ki 32.40±n/a nM
CommentsPDSP_8443
Citation Ghirmai, SAzar, MRPolgar, WEBerzetei-Gurske, ICashman, JR Synthesis and biological evaluation of alpha- and beta-6-amido derivatives of 17-cyclopropylmethyl-3, 14beta-dihydroxy-4, 5alpha-epoxymorphinan: potential alcohol-cessation agents. J Med Chem51:1913-24 (2008) 
 
Delta-type opioid receptor
Name:Delta-type opioid receptor
Type:G Protein-Coupled Receptor (GPCR)
Mol. Mass.:40382.98
Organism:Homo sapiens (Human)
Description:Competition binding assays were carried out using membrane preparations from transfected HN9.10 cells that constitutively expressed the delta opioid receptor.
Residue:372
BDBM86933
NameBDBM86933
Synonyms:17-cyclopropylmethyl-3,14-beta-dihydroxy-4,5-alpha-epoxy-6-alpha-[(thiophen-2'-yl)acetamido]morphinan CAS_24822459 NSC_24822459 | NSC_24822965
TypeSmall organic molecule
Emp. Form.C26H30N2O4S
Mol. Mass.466.592
SMILESOc1ccc2CC3N(CC4CC4)CCC45C(Oc1c24)C(CCC35O)NC(=O)Cc1cccs1