Reaction Details
TargetKappa-type opioid receptor
LigandBDBM86948
Substrate/Competitorn/a
Ki 0.28±n/a nM
CommentsPDSP_8459
Citation Ghirmai, SAzar, MRPolgar, WEBerzetei-Gurske, ICashman, JR Synthesis and biological evaluation of alpha- and beta-6-amido derivatives of 17-cyclopropylmethyl-3, 14beta-dihydroxy-4, 5alpha-epoxymorphinan: potential alcohol-cessation agents. J Med Chem51:1913-24 (2008) 
 
Kappa-type opioid receptor
Name:Kappa-type opioid receptor
Type:G Protein-Coupled Receptor (GPCR)
Mol. Mass.:42648.76
Organism:Homo sapiens (Human)
Description:P41145
Residue:380
BDBM86948
NameBDBM86948
Synonyms:17-cyclopropylmethyl-3,14-beta-dihydroxy-4,5-alpha-epoxy-6-beta-[(3'-nitro)benzamido]morphinan NSC_24822632
TypeSmall organic molecule
Emp. Form.C27H29N3O6
Mol. Mass.491.5357
SMILESOc1ccc2CC3N(CC4CC4)CCC45C(Oc1c24)C(CCC35O)NC(=O)c1cccc(c1)[N+]([O-])=O