Reaction Details
TargetKappa-type opioid receptor
LigandBDBM86943
Substrate/Competitorn/a
Ki 0.79±n/a nM
CommentsPDSP_8451
Citation Ghirmai, SAzar, MRPolgar, WEBerzetei-Gurske, ICashman, JR Synthesis and biological evaluation of alpha- and beta-6-amido derivatives of 17-cyclopropylmethyl-3, 14beta-dihydroxy-4, 5alpha-epoxymorphinan: potential alcohol-cessation agents. J Med Chem51:1913-24 (2008) 
 
Kappa-type opioid receptor
Name:Kappa-type opioid receptor
Type:G Protein-Coupled Receptor (GPCR)
Mol. Mass.:42648.76
Organism:Homo sapiens (Human)
Description:P41145
Residue:380
BDBM86943
NameBDBM86943
Synonyms:17-cyclopropylmethyl-3,14-beta-dihydroxy-4,5-alpha-epoxy-6-beta-[(4'-tert-butoxycarbonylamino)benzamido]morphinan NSC_24822298
TypeSmall organic molecule
Emp. Form.C32H39N3O6
Mol. Mass.561.6686
SMILESCC(C)(C)OC(=O)Nc1ccc(cc1)C(=O)NC1CCC2(O)C3Cc4ccc(O)c5OC1C2(CCN3CC1CC1)c45