Reaction Details
TargetKappa-type opioid receptor
LigandBDBM86925
Substrate/Competitorn/a
Ki 1.70±n/a nM
CommentsPDSP_8450
Citation Ghirmai, SAzar, MRPolgar, WEBerzetei-Gurske, ICashman, JR Synthesis and biological evaluation of alpha- and beta-6-amido derivatives of 17-cyclopropylmethyl-3, 14beta-dihydroxy-4, 5alpha-epoxymorphinan: potential alcohol-cessation agents. J Med Chem51:1913-24 (2008) 
 
Kappa-type opioid receptor
Name:Kappa-type opioid receptor
Type:G Protein-Coupled Receptor (GPCR)
Mol. Mass.:42648.76
Organism:Homo sapiens (Human)
Description:P41145
Residue:380
BDBM86925
NameBDBM86925
Synonyms:17-cyclopropylmethyl-3,14-beta-dihydroxy-4,5-alpha-epoxy-6-[(3'-dimethylamino)benzamido]morphinan NSC_44456833
TypeSmall organic molecule
Emp. Form.C29H35N3O4
Mol. Mass.489.6059
SMILESCN(C)c1cccc(c1)C(=O)NC1CCC2(O)C3Cc4ccc(O)c5OC1C2(CCN3CC1CC1)c45