Reaction Details
TargetMu-type opioid receptor
LigandBDBM86931
Substrate/Competitorn/a
Ki 0.67±n/a nM
CommentsPDSP_8466
Citation Ghirmai, SAzar, MRPolgar, WEBerzetei-Gurske, ICashman, JR Synthesis and biological evaluation of alpha- and beta-6-amido derivatives of 17-cyclopropylmethyl-3, 14beta-dihydroxy-4, 5alpha-epoxymorphinan: potential alcohol-cessation agents. J Med Chem51:1913-24 (2008) 
 
Mu-type opioid receptor
Name:Mu-type opioid receptor
Type:G Protein-Coupled Receptor (GPCR)
Mol. Mass.:44789.51
Organism:Homo sapiens (Human)
Description:P35372
Residue:400
BDBM86931
NameBDBM86931
Synonyms:17-cyclopropylmethyl-3,14-beta-dihydroxy-4,5-alpha-epoxy-6-alpha-[(D-glucopyranosyl)acetamido]morphinan CAS_24822461 NSC_24822461 | NSC_24824634
TypeSmall organic molecule
Emp. Form.C28H38N2O9
Mol. Mass.546.6093
SMILESOCC1OC(CC(=O)NC2CCC3(O)C4Cc5ccc(O)c6OC2C3(CCN4CC2CC2)c56)C(O)C(O)C1O