Reaction Details
TargetMu-type opioid receptor
LigandBDBM86933
Substrate/Competitorn/a
Ki 0.38±n/a nM
CommentsPDSP_8442
Citation Ghirmai, SAzar, MRPolgar, WEBerzetei-Gurske, ICashman, JR Synthesis and biological evaluation of alpha- and beta-6-amido derivatives of 17-cyclopropylmethyl-3, 14beta-dihydroxy-4, 5alpha-epoxymorphinan: potential alcohol-cessation agents. J Med Chem51:1913-24 (2008) 
 
Mu-type opioid receptor
Name:Mu-type opioid receptor
Type:G Protein-Coupled Receptor (GPCR)
Mol. Mass.:44789.51
Organism:Homo sapiens (Human)
Description:P35372
Residue:400
BDBM86933
NameBDBM86933
Synonyms:17-cyclopropylmethyl-3,14-beta-dihydroxy-4,5-alpha-epoxy-6-alpha-[(thiophen-2'-yl)acetamido]morphinan CAS_24822459 NSC_24822459 | NSC_24822965
TypeSmall organic molecule
Emp. Form.C26H30N2O4S
Mol. Mass.466.592
SMILESOc1ccc2CC3N(CC4CC4)CCC45C(Oc1c24)C(CCC35O)NC(=O)Cc1cccs1