Reaction Details
TargetMu-type opioid receptor
LigandBDBM86946
Substrate/Competitorn/a
Ki 0.31±n/a nM
CommentsPDSP_8454
Citation Ghirmai, SAzar, MRPolgar, WEBerzetei-Gurske, ICashman, JR Synthesis and biological evaluation of alpha- and beta-6-amido derivatives of 17-cyclopropylmethyl-3, 14beta-dihydroxy-4, 5alpha-epoxymorphinan: potential alcohol-cessation agents. J Med Chem51:1913-24 (2008) 
 
Mu-type opioid receptor
Name:Mu-type opioid receptor
Type:G Protein-Coupled Receptor (GPCR)
Mol. Mass.:44789.51
Organism:Homo sapiens (Human)
Description:P35372
Residue:400
BDBM86946
NameBDBM86946
Synonyms:17-cyclopropylmethyl-3,14-beta-dihydroxy-4,5-alpha-epoxy-6-beta-[(2'-pyridyl)acetamido]morphinan NSC_24822798
TypeSmall organic molecule
Emp. Form.C26H29N3O4
Mol. Mass.447.5262
SMILESOc1ccc2CC3N(CC4CC4)CCC45C(Oc1c24)C(CCC35O)NC(=O)c1ccccn1