Reaction Details
TargetCannabinoid receptor 1
LigandBDBM86989
Substrate/Competitorn/a
Ki 3±n/a nM
CommentsPDSP_8476
Citation Alig, LAlsenz, JAndjelkovic, MBendels, SBénardeau, ABleicher, KBourson, ADavid-Pierson, PGuba, WHildbrand, SKube, DLübbers, TMayweg, AVNarquizian, RNeidhart, WNettekoven, MPlancher, JMRocha, CRogers-Evans, MRöver, SSchneider, GTaylor, SWaldmeier, P Benzodioxoles: novel cannabinoid-1 receptor inverse agonists for the treatment of obesity. J Med Chem51:2115-27 (2008) 
 
Cannabinoid receptor 1
Name:Cannabinoid receptor 1
Type:G Protein-Coupled Receptor (GPCR)
Mol. Mass.:52868.96
Organism:Homo sapiens (Human)
Description:P21554
Residue:472
BDBM86989
NameBDBM86989
Synonyms:1-(2,2-bis(2,4-difluorophenyl)-6-fluorobenzo[d][1,3]dioxol-5-ylsulfonyl)-4,4-difluoropiperidine NSC_22475232
TypeSmall organic molecule
Emp. Form.C24H16F7NO4S
Mol. Mass.547.442
SMILESFc1ccc(c(F)c1)C1(Oc2cc(F)c(cc2O1)S(=O)(=O)N1CCC(F)(F)CC1)c1ccc(F)cc1F