Reaction Details
TargetCannabinoid receptor 1
LigandBDBM87010
Substrate/Competitorn/a
Ki 1500±n/a nM
CommentsPDSP_8499
Citation Alig, LAlsenz, JAndjelkovic, MBendels, SBénardeau, ABleicher, KBourson, ADavid-Pierson, PGuba, WHildbrand, SKube, DLübbers, TMayweg, AVNarquizian, RNeidhart, WNettekoven, MPlancher, JMRocha, CRogers-Evans, MRöver, SSchneider, GTaylor, SWaldmeier, P Benzodioxoles: novel cannabinoid-1 receptor inverse agonists for the treatment of obesity. J Med Chem51:2115-27 (2008) 
 
Cannabinoid receptor 1
Name:Cannabinoid receptor 1
Type:G Protein-Coupled Receptor (GPCR)
Mol. Mass.:52868.96
Organism:Homo sapiens (Human)
Description:P21554
Residue:472
BDBM87010
NameBDBM87010
Synonyms:1-(4-(4-chlorophenyl)-5,6-dihydropyridin-1(2H)-yl)-3,3-diphenylpropan-1-one NSC_44450451
TypeSmall organic molecule
Emp. Form.C26H24ClNO
Mol. Mass.401.928
SMILESClc1ccc(cc1)C1=CCN(CC1)C(=O)CC(c1ccccc1)c1ccccc1