Reaction Details
TargetSodium-dependent serotonin transporter
LigandBDBM87036
Substrate/Competitorn/a
Ki 11±n/a nM
CommentsPDSP_8629
Citation Fish, PVDeur, CGan, XGreene, KHoople, DMackenny, MPara, KSReeves, KRyckmans, TStiff, CStobie, AWakenhut, FWhitlock, GA Design and synthesis of morpholine derivatives. SAR for dual serotonin & noradrenaline reuptake inhibition. Bioorg Med Chem Lett18:2562-6 (2008) 
 
Sodium-dependent serotonin transporter
Name:Sodium-dependent serotonin transporter
Type:Multi-pass membrane protein
Mol. Mass.:70322.51
Organism:Homo sapiens (Human)
Description:P31645
Residue:630
BDBM87036
NameBDBM87036
Synonyms:(R)-2-((R)-(4-chloro-2-methoxyphenoxy)(phenyl)methyl)morpholine CAS_11638552 CAS_44449794 NSC_25009937 rac-syn-2-((4-chloro-2-methoxyphenoxy)(phenyl)methyl)morpholine
TypeSmall organic molecule
Emp. Form.C18H20ClNO3
Mol. Mass.333.809
SMILESCOc1cc(Cl)ccc1OC(C1CNCCO1)c1ccccc1