Reaction Details
TargetSodium-dependent noradrenaline transporter
LigandBDBM87037
Substrate/Competitorn/a
Ki 9±n/a nM
CommentsPDSP_8612
Citation Fish, PVDeur, CGan, XGreene, KHoople, DMackenny, MPara, KSReeves, KRyckmans, TStiff, CStobie, AWakenhut, FWhitlock, GA Design and synthesis of morpholine derivatives. SAR for dual serotonin & noradrenaline reuptake inhibition. Bioorg Med Chem Lett18:2562-6 (2008) 
 
Sodium-dependent noradrenaline transporter
Name:Sodium-dependent noradrenaline transporter
Type:Multi-pass membrane protein
Mol. Mass.:69337.72
Organism:Homo sapiens (Human)
Description:P23975
Residue:617
BDBM87037
NameBDBM87037
Synonyms:(S)-2-((S)-(4-chloro-2-methoxyphenoxy)(3-fluorophenyl)methyl)morpholine NSC_44450119
TypeSmall organic molecule
Emp. Form.C18H19ClFNO3
Mol. Mass.351.8
SMILESCOc1cc(Cl)ccc1OC(C1CNCCO1)c1cccc(F)c1