Reaction Details
TargetAurora kinase A
LigandBDBM87048
Substrate/Competitorn/a
Meas. Tech.Enzyme Activity Assay
pH7.4±0
Temperature298.15±0 K
IC50 6.1±1.0 nM
Kd 34±5.9 nM
Citation Martin, MPZhu, JYLawrence, HRPireddu, RLuo, YAlam, ROzcan, SSebti, SMLawrence, NJSchönbrunn, E A novel mechanism by which small molecule inhibitors induce the DFG flip in Aurora A. ACS Chem Biol7:698-706 (2012) 
 
Aurora kinase A
Name:Aurora kinase A
Type:Serine/threonine-protein kinase
Mol. Mass.:45830.98
Organism:Homo sapiens (Human)
Description:O14965
Residue:403
BDBM87048
NameBDBM87048
Synonyms:Bisanilinopyrimidine inhibitor, 2 US9249124, 1
TypeSmall organic molecule
Emp. Form.C18H14N4O4
Mol. Mass.350.3282
SMILESOC(=O)c1ccc(Nc2nccc(Nc3ccccc3C(O)=O)n2)cc1