Reaction Details
TargetAurora kinase A
LigandBDBM87051
Substrate/Competitorn/a
Meas. Tech.Enzyme Activity Assay
pH7.4±0
Temperature298.15±0 K
IC50 28±4.8 nM
Kd 40±5.6 nM
Citation Martin, MPZhu, JYLawrence, HRPireddu, RLuo, YAlam, ROzcan, SSebti, SMLawrence, NJSchönbrunn, E A novel mechanism by which small molecule inhibitors induce the DFG flip in Aurora A. ACS Chem Biol7:698-706 (2012) 
 
Aurora kinase A
Name:Aurora kinase A
Type:Serine/threonine-protein kinase
Mol. Mass.:45830.98
Organism:Homo sapiens (Human)
Description:O14965
Residue:403
BDBM87051
NameBDBM87051
Synonyms:Bisanilinopyrimidine inhibitor, 5 | Bisanilinopyrimidine, 6d
TypeSmall organic molecule
Emp. Form.C18H13F3N4O3
Mol. Mass.390.316
SMILESOC(=O)c1ccc(Nc2nccc(Nc3ccccc3OC(F)(F)F)n2)cc1