Reaction Details
TargetAurora kinase A
LigandBDBM87055
Substrate/Competitorn/a
Meas. Tech.Enzyme Activity Assay
pH7.4±0
Temperature298.15±0 K
IC50 43±8.0 nM
Kd 51±5.5 nM
Citation Martin, MPZhu, JYLawrence, HRPireddu, RLuo, YAlam, ROzcan, SSebti, SMLawrence, NJSchönbrunn, E A novel mechanism by which small molecule inhibitors induce the DFG flip in Aurora A. ACS Chem Biol7:698-706 (2012) 
 
Aurora kinase A
Name:Aurora kinase A
Type:Serine/threonine-protein kinase
Mol. Mass.:45830.98
Organism:Homo sapiens (Human)
Description:O14965
Residue:403
BDBM87055
NameBDBM87055
Synonyms:Bisanilinopyrimidine inhibitor, 9 US9249124, 37
TypeSmall organic molecule
Emp. Form.C18H13N5O2
Mol. Mass.331.3281
SMILESOC(=O)c1ccc(Nc2nccc(Nc3ccccc3C#N)n2)cc1