Reaction Details
Target6-phosphogluconate dehydrogenase, decarboxylating
LigandBDBM87063
Substrate/Competitorn/a
Meas. Tech.Enzyme Assay
Ki 87800±27400 nM
IC50 60100±0.0 nM
Citation Bülbül, MErat, M Investigation of the effects of some sulfonamide derivatives on the activities of glucose-6-phosphate dehydrogenase, 6-phospho gluconate dehydrogenase and glutathione reductase from human erythrocytes. J Enzyme Inhib Med Chem23:418-23 (2008) 
 
6-phosphogluconate dehydrogenase, decarboxylating
Name:6-phosphogluconate dehydrogenase, decarboxylating
Type:Protein
Mol. Mass.:53143.42
Organism:Homo sapiens (Human)
Description:P52209
Residue:483
BDBM87063
NameBDBM87063
Synonyms:Sulfonamide derivative, 3
TypeSmall organic molecule
Emp. Form.C26H42N4O6S2
Mol. Mass.570.765
SMILESCC(CCC(=O)Nc1nnc(s1)S(N)(=O)=O)C1CCC2C3C(O)CC4CC(O)CCC4(C)C3CC(O)C12C