Reaction Details
TargetNuclear receptor coactivator 3
LigandBDBM50127140
Substrate/Competitorn/a
Meas. Tech.Luminescence-based cell-based high throughput dose response assay for inhibitors of the Steroid Receptor Coactivator 3 (SRC3; NCOA3)
IC50 2482±n/a nM
Citation PubChem, PC Luminescence-based cell-based high throughput dose response assay for inhibitors of the Steroid Receptor Coactivator 3 (SRC3; NCOA3) PubChem Bioassay(2012)[AID]
 
Nuclear receptor coactivator 3
Name:Nuclear receptor coactivator 3
Type:Enzyme Catalytic Domain
Mol. Mass.:155305.29
Organism:Homo sapiens (Human)
Description:Q9Y6Q9
Residue:1424
BDBM50127140
NameBDBM50127140
Synonyms:(-)-etoposide 4'-Demethylepipodophyllotoxin 9-(4,6-O-(R)-ethylidene-beta-D-glucopyranoside) 9-((4,6-O-Ethylidine-beta-D-glucopyranosyl)oxy)-5,8,8a,9-tetrahydro-5-(4-hydroxy-3,4-dimethyloxyphenyl)furo(3',4'':6,7)naptho-(2,3-d)-1,3-dioxol-6(5aH)-one Etoposide (ET) VP-16 | etoposide
TypeSmall organic molecule
Emp. Form.C29H32O13
Mol. Mass.588.5566
SMILESCOc1cc(cc(OC)c1O)[C@H]1[C@@H]2[C@H](COC2=O)[C@H](O[C@@H]2O[C@@H]3CO[C@@H](C)O[C@H]3[C@H](O)[C@H]2O)c2cc3OCOc3cc12