Reaction Details
TargetNuclear receptor coactivator 1
LigandBDBM87256
Substrate/Competitorn/a
Meas. Tech.Counterscreen for inhibitors of the Steroid Receptor Coactivator 3 (SRC3; NCOA3)
IC50 7475±n/a nM
Citation PubChem, PC Counterscreen for inhibitors of the Steroid Receptor Coactivator 3 (SRC3; NCOA3): Luminescence-based cell-based high throughput dose response assay to identify inhibitors of the Steroid Receptor Coactivator 1 (SRC1; NCOA1) PubChem Bioassay(2012)[AID]
 
Nuclear receptor coactivator 1
Name:Nuclear receptor coactivator 1
Type:PROTEIN
Mol. Mass.:156749.34
Organism:Homo sapiens (Human)
Description:ChEMBL_759690
Residue:1441
BDBM87256
NameBDBM87256
Synonyms:MLS000040549 N-cyclohexyl-N-[(2-oxidanylidene-1H-quinolin-3-yl)methyl]pyridine-4-carboxamide N-cyclohexyl-N-[(2-oxo-1H-quinolin-3-yl)methyl]pyridine-4-carboxamide cid_663857
TypeSmall organic molecule
Emp. Form.C22H23N3O2
Mol. Mass.361.4369
SMILESO=C(N(Cc1cc2ccccc2[nH]c1=O)C1CCCCC1)c1ccncc1