Reaction Details
TargetNuclear receptor coactivator 1
LigandBDBM87259
Substrate/Competitorn/a
Meas. Tech.Counterscreen for inhibitors of the Steroid Receptor Coactivator 3 (SRC3; NCOA3)
IC50 9061±n/a nM
Citation PubChem, PC Counterscreen for inhibitors of the Steroid Receptor Coactivator 3 (SRC3; NCOA3): Luminescence-based cell-based high throughput dose response assay to identify inhibitors of the Steroid Receptor Coactivator 1 (SRC1; NCOA1) PubChem Bioassay(2012)[AID]
 
Nuclear receptor coactivator 1
Name:Nuclear receptor coactivator 1
Type:PROTEIN
Mol. Mass.:156749.34
Organism:Homo sapiens (Human)
Description:ChEMBL_759690
Residue:1441
BDBM87259
NameBDBM87259
Synonyms:1-(6-Allyloxy-7-methyl-6H-2-oxa-1,3,6-triaza-as-indacen-8-yl)-ethanone 1-(7-methyl-6-prop-2-enoxy-8-pyrrolo[2,3-g][2,1,3]benzoxadiazolyl)ethanone 1-(7-methyl-6-prop-2-enoxypyrrolo[2,3-g][2,1,3]benzoxadiazol-8-yl)ethanone SMR000117328 | cid_2268220
TypeSmall organic molecule
Emp. Form.C14H13N3O3
Mol. Mass.271.2713
SMILESCC(=O)c1c(C)n(OCC=C)c2ccc3nonc3c12